Reaction Details
Target5-hydroxytryptamine receptor 1A
LigandBDBM25761
Substrate/Competitorn/a
Ki 55±n/a nM
CommentsPDSP_1538
Citation Hamon, MLanfumey, Lel Mestikawy, SBoni, CMiquel, MCBolaños, FSchechter, LGozlan, H The main features of central 5-HT1 receptors. Neuropsychopharmacology3:349-60 (1990) 5-hydroxytryptamine receptor 1A
Name:5-hydroxytryptamine receptor 1A
Type:n/a
Mol. Mass.:46122.49
Organism:Homo sapiens (Human)
Description:n/a
Residue:422
BDBM25761
NameBDBM25761
Synonyms:Anapriline CHEMBL27 PROPRANOLOL, d PROPRANOLOL,(+) Propanolol Propranolol | [2-hydroxy-3-(naphthalen-1-yloxy)propyl](propan-2-yl)amine
TypeSmall organic molecule
Emp. Form.C16H21NO2
Mol. Mass.259.3434
SMILESCC(C)NCC(O)COc1cccc2ccccc12