Reaction Details
Target5-hydroxytryptamine receptor 1A
LigandBDBM86708
Substrate/Competitorn/a
Ki 0.1±n/a nM
CommentsPDSP_1954
Citation Hamon, MLanfumey, Lel Mestikawy, SBoni, CMiquel, MCBolaños, FSchechter, LGozlan, H The main features of central 5-HT1 receptors. Neuropsychopharmacology3:349-60 (1990) 5-hydroxytryptamine receptor 1A
Name:5-hydroxytryptamine receptor 1A
Type:n/a
Mol. Mass.:46122.49
Organism:Homo sapiens (Human)
Description:n/a
Residue:422
BDBM86708
NameBDBM86708
Synonyms:CAS_146714-97-8 CHEMBL514874 NSC_104911 | WAY 100,635
TypeSmall organic molecule
Emp. Form.C25H34N4O2
Mol. Mass.422.5631
SMILESCOc1ccccc1N1CCN(CCN(C(=O)C2CCCCC2)c2ccccn2)CC1