Reaction Details
TargetMuscarinic acetylcholine receptor M3
LigandBDBM50071173
Substrate/Competitorn/a
Ki 81.28±n/a nM
CommentsPDSP_933
Citation Lazareno, SBuckley, NJRoberts, FF Characterization of muscarinic M4 binding sites in rabbit lung, chicken heart, and NG108-15 cells. Mol Pharmacol38:805-15 (1990) Muscarinic acetylcholine receptor M3
Name:Muscarinic acetylcholine receptor M3
Type:Enzyme Catalytic Domain
Mol. Mass.:66086.66
Organism:RAT
Description:Cholinergic, muscarinic M3 CHRM3 RAT::P08483
Residue:589
BDBM50071173
NameBDBM50071173
Synonyms:(3R,4R,4aS,8aR)-4-[(E)-2-((2S,6S)-1,6-Dimethyl-piperidin-2-yl)-vinyl]-3-methyl-decahydro-naphtho[2,3-c]furan-1-one HIMBACINE
TypeSmall organic molecule
Emp. Form.C22H35NO2
Mol. Mass.345.5188
SMILESC[C@H]1OC(=O)C2C[C@H]3CCCC[C@@H]3[C@@H](\C=C\[C@@H]3CCC[C@H](C)N3C)C12