Reaction Details
TargetMuscarinic acetylcholine receptor M4
LigandBDBM50176065
Substrate/Competitorn/a
Ki 4.79±n/a nM
CommentsPDSP_111
Citation Lazareno, SBuckley, NJRoberts, FF Characterization of muscarinic M4 binding sites in rabbit lung, chicken heart, and NG108-15 cells. Mol Pharmacol38:805-15 (1990) Muscarinic acetylcholine receptor M4
Name:Muscarinic acetylcholine receptor M4
Type:Enzyme Catalytic Domain
Mol. Mass.:54968.10
Organism:Chick
Description:Cholinergic, muscarinic M4 CHRM4 Chick::P17200
Residue:490
BDBM50176065
NameBDBM50176065
Synonyms:4-DAMP Acetic acid 4-[(4-acetoxy-phenyl)-pyridin-2-yl-methyl]-phenyl ester CHEMBL76897
TypeSmall organic molecule
Emp. Form.C21H26NO2
Mol. Mass.324.4361
SMILESC[N+]1(C)CCC(CC1)OC(=O)C(c1ccccc1)c1ccccc1