Reaction Details
TargetMuscarinic acetylcholine receptor
LigandBDBM86231
Substrate/Competitorn/a
Ki 0.28±n/a nM
CommentsPDSP_334
Citation Lazareno, SBuckley, NJRoberts, FF Characterization of muscarinic M4 binding sites in rabbit lung, chicken heart, and NG108-15 cells. Mol Pharmacol38:805-15 (1990) Muscarinic acetylcholine receptor
Name:Muscarinic acetylcholine receptor
Type:Enzyme Catalytic Domain
Mol. Mass.:53017.26
Organism:RABBIT
Description:Cholinergic, muscarinic M4 CHRM4 RABBIT::PPPPPP
Residue:478
BDBM86231
NameBDBM86231
Synonyms:ATR Atropine,(-) CHEMBL195 US9333195, ATROPINE
TypeSmall organic molecule
Emp. Form.C17H23NO3
Mol. Mass.289.3694
SMILESCN1C2CCC1CC(C2)OC(=O)C(CO)c1ccccc1