Reaction Details
TargetMuscarinic acetylcholine receptor
LigandBDBM50240680
Substrate/Competitorn/a
Ki 2.04±n/a nM
CommentsPDSP_3895
Citation Lazareno, SBuckley, NJRoberts, FF Characterization of muscarinic M4 binding sites in rabbit lung, chicken heart, and NG108-15 cells. Mol Pharmacol38:805-15 (1990) Muscarinic acetylcholine receptor
Name:Muscarinic acetylcholine receptor
Type:Enzyme Catalytic Domain
Mol. Mass.:53017.26
Organism:RABBIT
Description:Cholinergic, muscarinic M4 CHRM4 RABBIT::PPPPPP
Residue:478
BDBM50240680
NameBDBM50240680
Synonyms:1-(bicyclo[2.2.1]hept-5-en-2-yl)-1-phenyl-3-(piperidin-1-yl)propan-1-ol CHEMBL1101 alpha-bicyclo[2.2.1]hept-5-en-2-yl-alpha-phenyl-1-piperidinepropanol
TypeSmall organic molecule
Emp. Form.C21H29NO
Mol. Mass.311.4611
SMILESOC(CCN1CCCCC1)(C1CC2CC1C=C2)c1ccccc1