Reaction Details
TargetMuscarinic acetylcholine receptor
LigandBDBM81800
Substrate/Competitorn/a
Ki 0.49±n/a nM
CommentsPDSP_1700
Citation Lazareno, SBuckley, NJRoberts, FF Characterization of muscarinic M4 binding sites in rabbit lung, chicken heart, and NG108-15 cells. Mol Pharmacol38:805-15 (1990) Muscarinic acetylcholine receptor
Name:Muscarinic acetylcholine receptor
Type:Enzyme Catalytic Domain
Mol. Mass.:53017.26
Organism:RABBIT
Description:Cholinergic, muscarinic M4 CHRM4 RABBIT::PPPPPP
Residue:478
BDBM81800
NameBDBM81800
Synonyms:CAS_57558-44-8 Secoverine
TypeSmall organic molecule
Emp. Form.C22H35NO2
Mol. Mass.345.5188
SMILESCCN(CCCC(=O)C1CCCCC1)C(C)Cc1ccc(OC)cc1