Reaction Details
TargetBeta-arrestin-1
LigandBDBM50002829
Substrate/Competitorn/a
Ki 205±n/a nM
CommentsPDSP_1056
Citation Hwang, SBLam, MHAlberts, AWBugianesi, RLChabala, JCPonpipom, MM Biochemical and pharmacological characterization of L-659,989: an extremely potent, selective and competitive receptor antagonist of platelet-activating factor. J Pharmacol Exp Ther246:534-41 (1988) Beta-arrestin-1
Name:Beta-arrestin-1
Type:Enzyme Catalytic Domain
Mol. Mass.:46360.54
Organism:RABBIT
Description:Cholinergic, muscarinic 0 RABBIT::Q95223
Residue:410
BDBM50002829
NameBDBM50002829
Synonyms:(2S,5S)-2-(3-Methanesulfonyl-5-methoxy-4-propoxy-phenyl)-5-(3,4,5-trimethoxy-phenyl)-tetrahydro-furan L-659,989 L-659989 | L-662,418
TypeSmall organic molecule
Emp. Form.C24H32O8S
Mol. Mass.480.571
SMILESCCCOc1c(OC)cc(cc1S(C)(=O)=O)[C@@H]1CC[C@H](O1)c1cc(OC)c(OC)c(OC)c1