Reaction Details
TargetCholecystokinin
LigandBDBM50008673
Substrate/Competitorn/a
Ki>10000±n/a nM
CommentsPDSP_2243
Citation Pendley, CEFitzpatrick, LRCapolino, AJDavis, MAEsterline, NJJakubowska, ABertrand, PGuyon, CDubroeucq, MCMartin, GE RP 73870, a gastrin/cholecystokinin-B receptor antagonist with potent anti-ulcer activity in the rat. J Pharmacol Exp Ther273:1015-22 (1995) Cholecystokinin
Name:Cholecystokinin
Type:Enzyme Catalytic Domain
Mol. Mass.:12528.64
Organism:GUINEA PIG
Description:Cholecystokinin B 0 GUINEA PIG::P01356
Residue:114
BDBM50008673
NameBDBM50008673
Synonyms:2-(4-Chloro-benzoylamino)-3-(1H-indol-3-yl)-propionic acid Benzotript | CHEMBL96074
TypeSmall organic molecule
Emp. Form.C18H15ClN2O3
Mol. Mass.342.776
SMILESOC(=O)C(Cc1c[nH]c2ccccc12)NC(=O)c1ccc(Cl)cc1