Reaction Details
TargetCholecystokinin
LigandBDBM82235
Substrate/Competitorn/a
Ki 5.4±n/a nM
CommentsPDSP_2240
Citation Pendley, CEFitzpatrick, LRCapolino, AJDavis, MAEsterline, NJJakubowska, ABertrand, PGuyon, CDubroeucq, MCMartin, GE RP 73870, a gastrin/cholecystokinin-B receptor antagonist with potent anti-ulcer activity in the rat. J Pharmacol Exp Ther273:1015-22 (1995) Cholecystokinin
Name:Cholecystokinin
Type:Enzyme Catalytic Domain
Mol. Mass.:12528.64
Organism:GUINEA PIG
Description:Cholecystokinin B 0 GUINEA PIG::P01356
Residue:114
BDBM82235
NameBDBM82235
Synonyms:Gastrin I Gastrin-I-(1-17)
TypeSmall organic molecule
Emp. Form.C94H128N22O31S2
Mol. Mass.2126.281
SMILESCSCC[C@H](NC(=O)[C@H](Cc1c[nH]c2ccccc12)NC(=O)CNC(=O)[C@H](Cc1ccc(O)cc1)NC(=O)[C@H](C)NC(=O)[C@H](CCC(O)=O)NC(=O)[C@H](CCC(O)=O)NC(=O)[C@H](CCC(O)=O)NC(=O)[C@H](CCC(O)=O)NC(=O)[C@H](CCC(O)=O)NC(=O)[C@H](CCSC)NC(=O)[C@@H]1CCCN1C(=O)[C@@H]1CCCN1C(=O)[C@H](CCCN=C(N)N)NC(=O)[C@@H]1CCC(=O)N1)C(=O)N[C@@H](CC(O)=O)C(=O)N[C@@H](Cc1ccccc1)C(N)=O