Reaction Details
TargetCholecystokinin
LigandBDBM82241
Substrate/Competitorn/a
Ki 3.3±n/a nM
CommentsPDSP_2241
Citation Pendley, CEFitzpatrick, LRCapolino, AJDavis, MAEsterline, NJJakubowska, ABertrand, PGuyon, CDubroeucq, MCMartin, GE RP 73870, a gastrin/cholecystokinin-B receptor antagonist with potent anti-ulcer activity in the rat. J Pharmacol Exp Ther273:1015-22 (1995) Cholecystokinin
Name:Cholecystokinin
Type:Enzyme Catalytic Domain
Mol. Mass.:12528.64
Organism:GUINEA PIG
Description:Cholecystokinin B 0 GUINEA PIG::P01356
Residue:114
BDBM82241
NameBDBM82241
Synonyms:CAS_5534-95-2 Pentagastrin
TypeSmall organic molecule
Emp. Form.C37H49N7O9S
Mol. Mass.767.891
SMILESCSCCC(NC(=O)C(Cc1c[nH]c2ccccc12)NC(=O)CCNC(=O)OCC(C)C)C(=O)NC(CC(O)=O)C(=O)NC(Cc1ccccc1)C(N)=O