Reaction Details
TargetAlpha-1B adrenergic receptor
LigandBDBM25392
Substrate/Competitorn/a
Ki>10000±n/a nM
CommentsPDSP_996
Citation Horie, KHirasawa, ATsujimoto, G The pharmacological profile of cloned and stably expressed alpha 1b-adrenoceptor in CHO cells. Eur J Pharmacol268:399-407 (1994) 
 
Alpha-1B adrenergic receptor
Name:Alpha-1B adrenergic receptor
Type:Enzyme Catalytic Domain
Mol. Mass.:56514.13
Organism:C.H.O.
Description:adrenergic Alpha1B ADRA1B C.H.O.::P18841
Residue:515
BDBM25392
NameBDBM25392
Synonyms:4-[1-hydroxy-2-(isopropylamino)ethyl]pyrocatechol;hydrochloride 4-{1-hydroxy-2-[(propan-2-yl)amino]ethyl}benzene-1,2-diol, 2 ISOPROTERONOL Isoproterenol Isoproterenol,(+) Norisodrine | Novodrin
TypeSmall organic molecule
Emp. Form.C11H17NO3
Mol. Mass.211.2576
SMILESCC(C)NCC(O)c1ccc(O)c(O)c1