Reaction Details
TargetSolute carrier family 22 member 1
LigandBDBM30712
Substrate/Competitorn/a
Ki 25.11±n/a nM
CommentsPDSP_1428
Citation Schwinn, DAJohnston, GIPage, SOMosley, MJWilson, KHWorman, NPCampbell, SFidock, MDFurness, LMParry-Smith, DJ Cloning and pharmacological characterization of human alpha-1 adrenergic receptors: sequence corrections and direct comparison with other species homologues. J Pharmacol Exp Ther272:134-42 (1995) Solute carrier family 22 member 1
Name:Solute carrier family 22 member 1
Type:Enzyme Catalytic Domain
Mol. Mass.:62499.05
Organism:BOVINE
Description:adrenergic Alpha1 0 BOVINE::A7MBE0
Residue:563
BDBM30712
NameBDBM30712
Synonyms:6-tert-butyl-3-(2-imidazolin-2-ylmethyl)-2,4-dimethyl-phenol;hydrochloride 6-tert-butyl-3-(4,5-dihydro-1H-imidazol-2-ylmethyl)-2,4-dimethylphenol;hydrochloride Oxymetazoline cid_66259
TypeSmall organic molecule
Emp. Form.C16H24N2O
Mol. Mass.260.3746
SMILESCc1cc(c(O)c(C)c1CC1=NCCN1)C(C)(C)C