Reaction Details
TargetSolute carrier family 22 member 1
LigandBDBM50033312
Substrate/Competitorn/a
Ki 1.99±n/a nM
CommentsPDSP_181
Citation Schwinn, DAJohnston, GIPage, SOMosley, MJWilson, KHWorman, NPCampbell, SFidock, MDFurness, LMParry-Smith, DJ Cloning and pharmacological characterization of human alpha-1 adrenergic receptors: sequence corrections and direct comparison with other species homologues. J Pharmacol Exp Ther272:134-42 (1995) Solute carrier family 22 member 1
Name:Solute carrier family 22 member 1
Type:Enzyme Catalytic Domain
Mol. Mass.:62499.05
Organism:BOVINE
Description:adrenergic Alpha1 0 BOVINE::A7MBE0
Residue:563
BDBM50033312
NameBDBM50033312
Synonyms:Benzyl-(6-chloro-2-imidazol-1-yl-quinazolin-4-yl)-amine; dihydrochloride Urapidil-5-methyl
TypeSmall organic molecule
Emp. Form.C18H14ClN5
Mol. Mass.335.79
SMILESClc1ccc2nc(nc(NCc3ccccc3)c2c1)-n1ccnc1