Reaction Details
TargetSubstance-K receptor
LigandBDBM50051290
Substrate/Competitorn/a
Ki 100±n/a nM
CommentsPDSP_1749
Citation Emonds-Alt, XBichon, DDucoux, JPHeaulme, MMiloux, BPoncelet, MProietto, VVan Broeck, DVilain, PNeliat, G SR 142801, the first potent non-peptide antagonist of the tachykinin NK3 receptor. Life Sci56:0-32 (1995) 
 
Substance-K receptor
Name:Substance-K receptor
Type:Enzyme Catalytic Domain
Mol. Mass.:43868.63
Organism:Rattus norvegicus (Rat)
Description:Neurokinin NK2 TACR2 Murine::P16610
Residue:390
BDBM50051290
NameBDBM50051290
Synonyms:CHEMBL299377 SR 142801 SR-142801
TypeSmall organic molecule
Emp. Form.C35H41Cl2N3O2
Mol. Mass.606.625
SMILESCN(C(C)=O)C1(CCN(CCCC2(CCCN(C2)C(=O)c2ccccc2)c2ccc(Cl)c(Cl)c2)CC1)c1ccccc1