Reaction Details
TargetNeuromedin-K receptor
LigandBDBM50051290
Substrate/Competitorn/a
Ki 15±n/a nM
CommentsPDSP_1749
Citation Emonds-Alt, XBichon, DDucoux, JPHeaulme, MMiloux, BPoncelet, MProietto, VVan Broeck, DVilain, PNeliat, G SR 142801, the first potent non-peptide antagonist of the tachykinin NK3 receptor. Life Sci56:0-32 (1995) 
 
Neuromedin-K receptor
Name:Neuromedin-K receptor
Type:Enzyme Catalytic Domain
Mol. Mass.:51047.50
Organism:mouse
Description:P47937
Residue:452
BDBM50051290
NameBDBM50051290
Synonyms:CHEMBL299377 SR 142801 SR-142801
TypeSmall organic molecule
Emp. Form.C35H41Cl2N3O2
Mol. Mass.606.625
SMILESCN(C(C)=O)C1(CCN(CCCC2(CCCN(C2)C(=O)c2ccccc2)c2ccc(Cl)c(Cl)c2)CC1)c1ccccc1