Reaction Details
TargetType-2 angiotensin II receptor
LigandBDBM82259
Substrate/Competitorn/a
Ki 11.7±n/a nM
CommentsPDSP_1019
Citation Beauchamp, HTChang, RSSiegl, PKGibson, RE In vivo receptor occupancy of the angiotensin II receptor by nonpeptide antagonists: relationship to in vitro affinities and in vivo pharmacologic potency. J Pharmacol Exp Ther272:612-8 (1995) Type-2 angiotensin II receptor
Name:Type-2 angiotensin II receptor
Type:Enzyme Catalytic Domain
Mol. Mass.:41346.62
Organism:RAT
Description:Angiotensin II AT2 0 0::P35351
Residue:363
BDBM82259
NameBDBM82259
Synonyms:CAS_123856 NSC_123856
TypeSmall organic molecule
Emp. Form.C23H21N7
Mol. Mass.395.4597
SMILESCCc1nc2c(C)cc(C)nc2n1-c1ccc(cc1)-c1ccccc1-c1nnn[nH]1