Reaction Details
TargetType-2 angiotensin II receptor
LigandBDBM82434
Substrate/Competitorn/a
Ki 437±n/a nM
CommentsPDSP_1027
Citation Beauchamp, HTChang, RSSiegl, PKGibson, RE In vivo receptor occupancy of the angiotensin II receptor by nonpeptide antagonists: relationship to in vitro affinities and in vivo pharmacologic potency. J Pharmacol Exp Ther272:612-8 (1995) Type-2 angiotensin II receptor
Name:Type-2 angiotensin II receptor
Type:Enzyme Catalytic Domain
Mol. Mass.:41346.62
Organism:RAT
Description:Angiotensin II AT2 0 0::P35351
Residue:363
BDBM82434
NameBDBM82434
Synonyms:2-Butyl-6-(dimethylamino)-3-[[2-(cyclopropylcarbonylmethylsulfonyl)biphenyl-4'-yl]methyl]quinazolin-4(3H)-one L-161865
TypeSmall organic molecule
Emp. Form.C32H35N3O4S
Mol. Mass.557.703
SMILES[#6]-[#6]-[#6]-[#6]-c1nc2ccc(cc2c(=O)n1-[#6]-c1ccc(cc1)-c1ccccc1[S;v6](=O)(=O)[#6]-[#6](=O)-[#6]-1-[#6]-[#6]-1)-[#7](-[#6])-[#6]