Reaction Details
Target5-hydroxytryptamine receptor 2C
LigandBDBM50014247
Substrate/Competitorn/a
Ki 130±n/a nM
CommentsPDSP_811
Citation Cusack, BNelson, ARichelson, E Binding of antidepressants to human brain receptors: focus on newer generation compounds. Psychopharmacology (Berl)114:559-65 (1994) 
 
5-hydroxytryptamine receptor 2C
Name:5-hydroxytryptamine receptor 2C
Type:G Protein-Coupled Receptor (GPCR)
Mol. Mass.:51836.79
Organism:Homo sapiens (Human)
Description:P28335
Residue:458
BDBM50014247
NameBDBM50014247
Synonyms:(3R,4S)-3-(4-Methoxy-phenoxymethyl)-1-methyl-4-phenyl-piperidine CHEMBL94739 | Femoxetine
TypeSmall organic molecule
Emp. Form.C20H25NO2
Mol. Mass.311.418
SMILESCOc1ccc(OC[C@H]2CN(C)CC[C@@H]2c2ccccc2)cc1