Reaction Details
TargetAlpha-1A adrenergic receptor
LigandBDBM50079527
Substrate/Competitorn/a
Ki 23.5±n/a nM
CommentsPDSP_735
Citation Cusack, BNelson, ARichelson, E Binding of antidepressants to human brain receptors: focus on newer generation compounds. Psychopharmacology (Berl)114:559-65 (1994) 
 
Alpha-1A adrenergic receptor
Name:Alpha-1A adrenergic receptor
Type:Cell-surface receptors
Mol. Mass.:51511.67
Organism:Homo sapiens (Human)
Description:P35348
Residue:466
BDBM50079527
NameBDBM50079527
Synonyms:(3E)-3-dibenzo[b,e]oxepin-11(6H)-ylidene-N,N-dimethylpropan-1-amine(3Z)-3-dibenzo[b,e]oxepin-11(6H)-ylidene-N,N-dimethylpropan-1-amine DOXEPIN | cis-doxepin
TypeSmall organic molecule
Emp. Form.C19H21NO
Mol. Mass.279.3761
SMILESCN(C)CC\C=C1\c2ccccc2COc2ccccc12