Reaction Details
TargetAlpha-1A adrenergic receptor
LigandBDBM82217
Substrate/Competitorn/a
Ki 380±n/a nM
CommentsPDSP_1710
Citation Cusack, BNelson, ARichelson, E Binding of antidepressants to human brain receptors: focus on newer generation compounds. Psychopharmacology (Berl)114:559-65 (1994) 
 
Alpha-1A adrenergic receptor
Name:Alpha-1A adrenergic receptor
Type:Cell-surface receptors
Mol. Mass.:51511.67
Organism:Homo sapiens (Human)
Description:P35348
Residue:466
BDBM82217
NameBDBM82217
Synonyms:CHEMBL284994 SERTRALINE | [4-(3,4-Dichloro-phenyl)-1,2,3,4-tetrahydro-naphthalen-1-yl]-methyl-amine
Typen/a
Emp. Form.C17H17Cl2N
Mol. Mass.306.23
SMILESCN[C@@H]1CC[C@@H](c2ccc(Cl)c(Cl)c2)c2ccccc12