Reaction Details
TargetHistamine H1 receptor
LigandBDBM112777
Substrate/Competitorn/a
Ki 6.3±n/a nM
CommentsPDSP_1363
Citation Cusack, BNelson, ARichelson, E Binding of antidepressants to human brain receptors: focus on newer generation compounds. Psychopharmacology (Berl)114:559-65 (1994) 
 
Histamine H1 receptor
Name:Histamine H1 receptor
Type:G Protein-Coupled Receptor (GPCR)
Mol. Mass.:55808.72
Organism:Homo sapiens (Human)
Description:Cell pellets from SK-N-MC cells transfected with human H1 receptor were used in binding assay.
Residue:487
BDBM112777
NameBDBM112777
Synonyms:NORTRIPTYLINE | US8629135, SW-02
TypeSmall organic molecule
Emp. Form.C19H21N
Mol. Mass.263.3767
SMILES[#6]-[#7]-[#6]-[#6]\[#6]=[#6]-1/c2ccccc2-[#6]-[#6]-c2ccccc-12