Reaction Details
TargetPituitary adenylate cyclase-activating polypeptide
LigandBDBM81533
Substrate/Competitorn/a
Ki 60±n/a nM
CommentsPDSP_2365
Citation Hou, XVandermeers, AGourlet, PVandermeers-Piret, MCRobberecht, P Structural requirements for the occupancy of rat brain PACAP receptors and adenylate cyclase activation. Neuropharmacology33:1189-95 (1994) 
 
Pituitary adenylate cyclase-activating polypeptide
Name:Pituitary adenylate cyclase-activating polypeptide
Type:Enzyme Catalytic Domain
Mol. Mass.:19565.66
Organism:RAT
Description:PACAP 0 RAT::P13589
Residue:175
BDBM81533
NameBDBM81533
Synonyms:[Phe2]PACAP(1-27)
TypeSmall organic molecule
Emp. Form.C148H228N40O38S
Mol. Mass.3207.704
SMILESCCC(C)[C@H](NC(=O)CNC(=O)[C@H](CC(O)=O)NC(=O)[C@H](Cc1ccccc1)NC(=O)[C@@H](N)Cc1cnc[nH]1)C(=O)N[C@@H](Cc1ccccc1)C(=O)N[C@@H]([C@@H](C)O)C(=O)N[C@@H](CC(O)=O)C(=O)N[C@@H](CO)C(=O)N[C@@H](Cc1ccc(O)cc1)C(=O)N[C@@H](CO)C(=O)N[C@@H](CCCN=C(N)N)C(=O)N[C@@H](Cc1ccc(O)cc1)C(=O)N[C@@H](CCCN=C(N)N)C(=O)N[C@@H](CCCCN)C(=O)N[C@@H](CCC(N)=O)C(=O)N[C@@H](CCSC)C(=O)N[C@@H](C)C(=O)N[C@@H](C(C)C)C(=O)N[C@@H](CCCCN)C(=O)N[C@@H](CCCCN)C(=O)N[C@@H](Cc1ccc(O)cc1)C(=O)N[C@@H](CC(C)C)C(=O)N[C@@H](C)C(=O)N[C@@H](C)C(=O)N[C@@H](C(C)C)C(=O)N[C@@H](CC(C)C)C(N)=O