Reaction Details
TargetSomatostatin receptor type 5
LigandBDBM82462
Substrate/Competitorn/a
Ki 0.07±n/a nM
CommentsPDSP_388
Citation Hoyer, DLübbert, HBruns, C Molecular pharmacology of somatostatin receptors. Naunyn Schmiedebergs Arch Pharmacol350:441-53 (1994) 
 
Somatostatin receptor type 5
Name:Somatostatin receptor type 5
Type:Enzyme Catalytic Domain
Mol. Mass.:39986.50
Organism:RAT
Description:SOMATOSTATIN SST5 SSTR5 RAT::P30938
Residue:363
BDBM82462
NameBDBM82462
Synonyms:BIM 23059 | D-Nal-c[Cys-Tyr-D-Trp-Lys-Thr-Cys]-Thr-NH2
TypeSmall organic molecule
Emp. Form.C54H68N12O12S2
Mol. Mass.1141.321
SMILESCC(CO)C(NC(=O)C1NC(=O)N[C@@H](Cc2ccc(O)cc2)C(=O)N[C@H](Cc2c[nH]c3ccccc23)C(=O)N[C@@H](CCCCN)C(=O)N[C@@H](C(C)CO)C(=O)NC(SS1)C(=O)N[C@@H](Cc1ccc2ccccc2c1)C(N)=O)C(N)=O