Reaction Details
Target5-hydroxytryptamine receptor 3A
LigandBDBM82473
Substrate/Competitorn/a
Ki 0.21±n/a nM
CommentsPDSP_889
Citation Green, TStauffer, KALummis, SC Expression of recombinant homo-oligomeric 5-hydroxytryptamine3 receptors provides new insights into their maturation and structure. J Biol Chem270:6056-61 (1995) 
 
5-hydroxytryptamine receptor 3A
Name:5-hydroxytryptamine receptor 3A
Type:n/a
Mol. Mass.:56056.00
Organism:Mus musculus (house mouse)
Description:5HT3A
Residue:487
BDBM82473
NameBDBM82473
Synonyms:CAS_124006 NSC_124006
TypeSmall organic molecule
Emp. Form.C16H17N3O
Mol. Mass.267.3257
SMILESCc1nc[nH]c1CCC(=O)c1cc2ccccc2n1C