Reaction Details
TargetD1 dopamine receptor
LigandBDBM82247
Substrate/Competitorn/a
Ki 1.3±n/a nM
CommentsPDSP_1685
Citation Watts, VJLawler, CPGilmore, JHSoutherland, SBNichols, DEMailman, RB Dopamine D1 receptors: efficacy of full (dihydrexidine) vs. partial (SKF38393) agonists in primates vs. rodents. Eur J Pharmacol242:165-72 (1993) 
 
D1 dopamine receptor
Name:D1 dopamine receptor
Type:Enzyme Catalytic Domain
Mol. Mass.:8818.33
Organism:Monkey
Description:Q5I6B7
Residue:78
BDBM82247
NameBDBM82247
Synonyms:8-Chloro-3-methyl-5-phenyl-2,3,4,5-tetrahydro-1H-benzo[d]azepin-7-ol(SCH 23390) CHEMBL2158641 SCH 23388 SCH 23390 (R-enantiomer) | SCH 23390,R(+)
TypeSmall organic molecule
Emp. Form.C17H18ClNO
Mol. Mass.287.784
SMILESCN1CCc2cc(Cl)c(O)cc2[C@H](C1)c1ccccc1