Reaction Details
TargetAlpha-2C adrenergic receptor
LigandBDBM81773
Substrate/Competitorn/a
Ki 6.91±n/a nM
CommentsPDSP_340
Citation O'Rourke, MFBlaxall, HSIversen, LJBylund, DB Characterization of [3H]RX821002 binding to alpha-2 adrenergic receptor subtypes. J Pharmacol Exp Ther268:1362-7 (1994) Alpha-2C adrenergic receptor
Name:Alpha-2C adrenergic receptor
Type:Enzyme Catalytic Domain
Mol. Mass.:49890.50
Organism:RAT
Description:adrenergic Alpha2 0 RAT::P22086
Residue:458
BDBM81773
NameBDBM81773
Synonyms:BAM 1303 CAS_115219-10-8
TypeSmall organic molecule
Emp. Form.C25H25BrN4
Mol. Mass.461.397
SMILESCN1C[C@H](Cn2ccnc2-c2ccccc2)C[C@H]2[C@H]1Cc1c(Br)[nH]c3cccc2c13