Reaction Details
TargetAlpha-2B adrenergic receptor
LigandBDBM35234
Substrate/Competitorn/a
Ki 123.02±n/a nM
CommentsPDSP_1348
Citation O'Rourke, MFBlaxall, HSIversen, LJBylund, DB Characterization of [3H]RX821002 binding to alpha-2 adrenergic receptor subtypes. J Pharmacol Exp Ther268:1362-7 (1994) Alpha-2B adrenergic receptor
Name:Alpha-2B adrenergic receptor
Type:Enzyme Catalytic Domain
Mol. Mass.:41875.91
Organism:OPOSSUM
Description:adrenergic Alpha2 0 OPOSSUM::O77715
Residue:382
BDBM35234
NameBDBM35234
Synonyms:DL-[7-3H]norepinephrine Noradrenaline,(+) | [3H]NE
Typeradiolabeled ligand
Emp. Form.C8H11NO3
Mol. Mass.169.1778
SMILESNCC(O)c1ccc(O)c(O)c1