Reaction Details
TargetAlpha-2A adrenergic receptor
LigandBDBM50013515
Substrate/Competitorn/a
Ki 9.77±n/a nM
CommentsPDSP_1590
Citation O'Rourke, MFBlaxall, HSIversen, LJBylund, DB Characterization of [3H]RX821002 binding to alpha-2 adrenergic receptor subtypes. J Pharmacol Exp Ther268:1362-7 (1994) Alpha-2A adrenergic receptor
Name:Alpha-2A adrenergic receptor
Type:Enzyme Catalytic Domain
Mol. Mass.:49275.13
Organism:BOVINE
Description:adrenergic Alpha2 0 BOVINE::Q28838
Residue:452
BDBM50013515
NameBDBM50013515
Synonyms:(+)-yohimbine 17alpha-hydroxyyohimban-16alpha-carboxylic acid methyl ester CORYNANTHINE Quebrachin YOHIMBINE CHLORIDE Yohimbine cid_8969 methyl 17alpha-hydroxyyohimban-16alpha-carboxylate yohimbic acid methyl ester
TypeSmall organic molecule
Emp. Form.C21H26N2O3
Mol. Mass.354.4427
SMILESCOC(=O)[C@H]1[C@@H](O)CC[C@H]2CN3CCc4c([nH]c5ccccc45)[C@@H]3C[C@H]12