Reaction Details
Target5-hydroxytryptamine receptor 2A
LigandBDBM79181
Substrate/Competitorn/a
Ki 3.98±n/a nM
CommentsPDSP_1908
Citation Roth, BLCraigo, SCChoudhary, MSUluer, AMonsma, FJShen, YMeltzer, HYSibley, DR Binding of typical and atypical antipsychotic agents to 5-hydroxytryptamine-6 and 5-hydroxytryptamine-7 receptors. J Pharmacol Exp Ther268:1403-10 (1994) 5-hydroxytryptamine receptor 2A
Name:5-hydroxytryptamine receptor 2A
Type:G Protein-Coupled Receptor (GPCR)
Mol. Mass.:52852.05
Organism:Rattus norvegicus (rat)
Description:Rat cortex membranes 5-HT2A receptors.
Residue:471
BDBM79181
NameBDBM79181
Synonyms:10-[3-(4-methyl-1-piperazinyl)propyl]-2-(trifluoromethyl)phenothiazine;hydrochloride 10-[3-(4-methylpiperazino)propyl]-2-(trifluoromethyl)phenothiazine;hydrochloride SMR000059133 TRIFLUOPERAZINE DIHYDROCHLORIDE US11542290, Compound Trifluoperazine cid_5566
TypeSmall organic molecule
Emp. Form.C21H24F3N3S
Mol. Mass.407.496
SMILESCN1CCN(CCCN2c3ccccc3Sc3ccc(cc23)C(F)(F)F)CC1