Reaction Details
Target5-hydroxytryptamine receptor 2C
LigandBDBM22870
Substrate/Competitorn/a
Ki 1.99±n/a nM
CommentsPDSP_290
Citation Roth, BLCraigo, SCChoudhary, MSUluer, AMonsma, FJShen, YMeltzer, HYSibley, DR Binding of typical and atypical antipsychotic agents to 5-hydroxytryptamine-6 and 5-hydroxytryptamine-7 receptors. J Pharmacol Exp Ther268:1403-10 (1994) 5-hydroxytryptamine receptor 2C
Name:5-hydroxytryptamine receptor 2C
Type:Enzyme
Mol. Mass.:51935.10
Organism:Rattus norvegicus (Rat)
Description:P08909
Residue:460
BDBM22870
NameBDBM22870
Synonyms:13-chloro-10-(piperazin-1-yl)-2-oxa-9-azatricyclo[9.4.0.0^{3,8}]pentadeca-1(11),3,5,7,9,12,14-heptaene Amoxapine CHEMBL1113 | Demolox
TypeSmall organic molecule
Emp. Form.C17H16ClN3O
Mol. Mass.313.781
SMILESClc1ccc2Oc3ccccc3N=C(N3CCNCC3)c2c1