Reaction Details
Target5-hydroxytryptamine receptor 6
LigandBDBM22872
Substrate/Competitorn/a
Ki 0.41±n/a nM
CommentsPDSP_549
Citation Roth, BLCraigo, SCChoudhary, MSUluer, AMonsma, FJShen, YMeltzer, HYSibley, DR Binding of typical and atypical antipsychotic agents to 5-hydroxytryptamine-6 and 5-hydroxytryptamine-7 receptors. J Pharmacol Exp Ther268:1403-10 (1994) 5-hydroxytryptamine receptor 6
Name:5-hydroxytryptamine receptor 6
Type:Enzyme Catalytic Domain
Mol. Mass.:46945.51
Organism:RAT
Description:5-HT6 HTR6 RAT::P31388
Residue:436
BDBM22872
NameBDBM22872
Synonyms:1-(3-chloro-5,6-dihydrobenzo[b][1]benzothiepin-5-yl)-4-methyl-piperazine;maleate 1-{6-chloro-2-thiatricyclo[9.4.0.0^{3,8}]pentadeca-1(15),3(8),4,6,11,13-hexaen-9-yl}-4-methylpiperazine CLOROTEPINE (+) Clothepin OCTOCLOTHEPIN,(-) Octoclothepine
TypeSmall organic molecule
Emp. Form.C19H21ClN2S
Mol. Mass.344.901
SMILESCN1CCN(CC1)C1Cc2ccccc2Sc2ccc(Cl)cc12