Reaction Details
Target5-hydroxytryptamine receptor 7
LigandBDBM50130257
Substrate/Competitorn/a
Ki 5.6±n/a nM
CommentsPDSP_515
Citation Roth, BLCraigo, SCChoudhary, MSUluer, AMonsma, FJShen, YMeltzer, HYSibley, DR Binding of typical and atypical antipsychotic agents to 5-hydroxytryptamine-6 and 5-hydroxytryptamine-7 receptors. J Pharmacol Exp Ther268:1403-10 (1994) 5-hydroxytryptamine receptor 7
Name:5-hydroxytryptamine receptor 7
Type:G Protein-Coupled Receptor (GPCR)
Mol. Mass.:49852.62
Organism:Rattus norvegicus (rat)
Description:Rat cloned 5-HT7R.
Residue:448
BDBM50130257
NameBDBM50130257
Synonyms:(3E)-3-(2-chloro-9H-thioxanthen-9-ylidene)-N,N-dimethylpropan-1-amine CHEMBL90125 Chlorprothixene (cis)
TypeSmall organic molecule
Emp. Form.C18H18ClNS
Mol. Mass.315.86
SMILESCN(C)CC\C=C1/c2ccccc2Sc2ccc(Cl)cc12