Reaction Details
Target5-hydroxytryptamine receptor 7
LigandBDBM78434
Substrate/Competitorn/a
Ki 196±n/a nM
CommentsPDSP_1531
Citation Roth, BLCraigo, SCChoudhary, MSUluer, AMonsma, FJShen, YMeltzer, HYSibley, DR Binding of typical and atypical antipsychotic agents to 5-hydroxytryptamine-6 and 5-hydroxytryptamine-7 receptors. J Pharmacol Exp Ther268:1403-10 (1994) 5-hydroxytryptamine receptor 7
Name:5-hydroxytryptamine receptor 7
Type:G Protein-Coupled Receptor (GPCR)
Mol. Mass.:49852.62
Organism:Rattus norvegicus (rat)
Description:Rat cloned 5-HT7R.
Residue:448
BDBM78434
NameBDBM78434
Synonyms:2-chloranyl-10-[3-(4-methylpiperazin-1-yl)propyl]phenothiazine;ethane-1,2-disulfonic acid 2-chloro-10-[3-(4-methylpiperazin-1-yl)propyl]phenothiazine;ethane-1,2-disulfonic acid Compazine MLS001148133 SMR000653454 | cid_91499
TypeSmall organic molecule
Emp. Form.C20H24ClN3S
Mol. Mass.373.943
SMILESCN1CCN(CCCN2c3ccccc3Sc3ccc(Cl)cc23)CC1