Reaction Details
TargetD(2) dopamine receptor
LigandBDBM78433
Substrate/Competitorn/a
Ki 0.5±n/a nM
CommentsPDSP_837
Citation Roth, BLCraigo, SCChoudhary, MSUluer, AMonsma, FJShen, YMeltzer, HYSibley, DR Binding of typical and atypical antipsychotic agents to 5-hydroxytryptamine-6 and 5-hydroxytryptamine-7 receptors. J Pharmacol Exp Ther268:1403-10 (1994) D(2) dopamine receptor
Name:D(2) dopamine receptor
Type:G Protein-Coupled Receptor (GPCR)
Mol. Mass.:50931.60
Organism:Rattus norvegicus (rat)
Description:P61169
Residue:444
BDBM78433
NameBDBM78433
Synonyms:2-[4-[3-[2-(trifluoromethyl)-10-phenothiazinyl]propyl]-1-piperazinyl]ethanol;hydrochloride 2-[4-[3-[2-(trifluoromethyl)phenothiazin-10-yl]propyl]piperazino]ethanol;hydrochloride FLUPHENAZINE HYDROCHLORIDE SMR000058411 cid_6602611 | med.21724, Compound 17
TypeSmall organic molecule
Emp. Form.C22H26F3N3OS
Mol. Mass.437.522
SMILESOCCN1CCN(CCCN2c3ccccc3Sc3ccc(cc23)C(F)(F)F)CC1