Reaction Details
TargetD(2) dopamine receptor
LigandBDBM35255
Substrate/Competitorn/a
Ki 1±n/a nM
CommentsPDSP_2002
Citation Roth, BLCraigo, SCChoudhary, MSUluer, AMonsma, FJShen, YMeltzer, HYSibley, DR Binding of typical and atypical antipsychotic agents to 5-hydroxytryptamine-6 and 5-hydroxytryptamine-7 receptors. J Pharmacol Exp Ther268:1403-10 (1994) D(2) dopamine receptor
Name:D(2) dopamine receptor
Type:G Protein-Coupled Receptor (GPCR)
Mol. Mass.:50931.60
Organism:Rattus norvegicus (rat)
Description:P61169
Residue:444
BDBM35255
NameBDBM35255
Synonyms:2-Chlor-11-(2-dimethylaminoaethoxy)-dibenzo(b,f)-thiepin 2-[(8-chlorodibenzo[b,f]thiepin-10-yl)oxy]-N,N-dimethylethanamine Nipolept zotepine
TypeSmall organic molecule
Emp. Form.C18H18ClNOS
Mol. Mass.331.86
SMILESCN(C)CCOC1=Cc2ccccc2Sc2ccc(Cl)cc12