Reaction Details
TargetBeta-2 adrenergic receptor
LigandBDBM25769
Substrate/Competitorn/a
Ki 2398.83±n/a nM
CommentsPDSP_263
Citation Fraundorfer, PFFertel, RHMiller, DDFeller, DR Biochemical and pharmacological characterization of high-affinity trimetoquinol analogs on guinea pig and human beta adrenergic receptor subtypes: evidence for partial agonism. J Pharmacol Exp Ther270:665-74 (1994) Beta-2 adrenergic receptor
Name:Beta-2 adrenergic receptor
Type:Enzyme Catalytic Domain
Mol. Mass.:46993.24
Organism:GUINEA PIG
Description:adrenergic Beta2 ADRB2 GUINEA PIG::Q8K4Z4
Residue:418
BDBM25769
NameBDBM25769
Synonyms:4-[2-(tert-butylamino)-1-hydroxyethyl]-2-(hydroxymethyl)phenol Proventil Salbutamol,(+/-) | albuterol
TypeSmall organic molecule
Emp. Form.C13H21NO3
Mol. Mass.239.3107
SMILESCC(C)(C)NCC(O)c1ccc(O)c(CO)c1