Reaction Details
TargetBeta-2 adrenergic receptor
LigandBDBM82487
Substrate/Competitorn/a
Ki 2.81±n/a nM
CommentsPDSP_1869
Citation Fraundorfer, PFFertel, RHMiller, DDFeller, DR Biochemical and pharmacological characterization of high-affinity trimetoquinol analogs on guinea pig and human beta adrenergic receptor subtypes: evidence for partial agonism. J Pharmacol Exp Ther270:665-74 (1994) Beta-2 adrenergic receptor
Name:Beta-2 adrenergic receptor
Type:Enzyme Catalytic Domain
Mol. Mass.:46993.24
Organism:GUINEA PIG
Description:adrenergic Beta2 ADRB2 GUINEA PIG::Q8K4Z4
Residue:418
BDBM82487
NameBDBM82487
Synonyms:TMQ, 3',5'-Diiodo
TypeSmall organic molecule
Emp. Form.C17H17I2NO3
Mol. Mass.537.1307
SMILESCOc1c(I)cc(CC2NCCc3cc(O)c(O)cc23)cc1I