Reaction Details
TargetBeta-2 adrenergic receptor
LigandBDBM82484
Substrate/Competitorn/a
Ki 1.69±n/a nM
CommentsPDSP_1871
Citation Fraundorfer, PFFertel, RHMiller, DDFeller, DR Biochemical and pharmacological characterization of high-affinity trimetoquinol analogs on guinea pig and human beta adrenergic receptor subtypes: evidence for partial agonism. J Pharmacol Exp Ther270:665-74 (1994) Beta-2 adrenergic receptor
Name:Beta-2 adrenergic receptor
Type:n/a
Mol. Mass.:46461.69
Organism:Homo sapiens (Human)
Description:P07550
Residue:413
BDBM82484
NameBDBM82484
Synonyms:TMQ, 3'-Iodo
TypeSmall organic molecule
Emp. Form.C18H20INO4
Mol. Mass.441.2602
SMILESCOc1cc(CC2NCCc3cc(O)c(O)cc23)cc(I)c1OC