Reaction Details
TargetPhosphatidylinositol 4,5-bisphosphate 3-kinase catalytic subunit alpha isoform
LigandBDBM272964
Substrate/Competitorn/a
Meas. Tech.p110alpha (alpha) PI3K Binding Assay
Ki<0.020±n/a nM
Citation Braun, MGarland, KHanan, EPurkey, HStaben, STHeald, RAKnight, JMacleod, CLu, AWu, GYeap, SK Tricyclic PI3K inhibitor compounds and methods of use US Patent US10065970 Publication Date 9/4/2018
 
Phosphatidylinositol 4,5-bisphosphate 3-kinase catalytic subunit alpha isoform
Name:Phosphatidylinositol 4,5-bisphosphate 3-kinase catalytic subunit alpha isoform
Type:Enzyme Subunit
Mol. Mass.:124294.87
Organism:Homo sapiens (Human)
Description:P42336
Residue:1068
BDBM272964
NameBDBM272964
Synonyms:(S)-2-((1-(3-fluoro-4- (1H-1,2,4-triazol-3- yl)phenyl)-7,8,9,10- tetrahydro-6-oxa-2,10a- diazacycloocta[cd]inden-4- yl)oxy)propanamide US10435414, Example 269
TypeSmall organic molecule
Emp. Form.C22H21FN6O3
Mol. Mass.436.4389
SMILESC[C@H](Oc1cc2OCCCCn3c(nc(c1)c23)-c1ccc(-c2nc[nH]n2)c(F)c1)C(N)=O