Reaction Details
TargetPhosphatidylinositol 4,5-bisphosphate 3-kinase catalytic subunit alpha isoform
LigandBDBM272976
Substrate/Competitorn/a
Meas. Tech.p110alpha (alpha) PI3K Binding Assay
Ki 0.027±n/a nM
Citation Braun, MGarland, KHanan, EPurkey, HStaben, STHeald, RAKnight, JMacleod, CLu, AWu, GYeap, SK Tricyclic PI3K inhibitor compounds and methods of use US Patent US10065970 Publication Date 9/4/2018
 
Phosphatidylinositol 4,5-bisphosphate 3-kinase catalytic subunit alpha isoform
Name:Phosphatidylinositol 4,5-bisphosphate 3-kinase catalytic subunit alpha isoform
Type:Enzyme Subunit
Mol. Mass.:124294.87
Organism:Homo sapiens (Human)
Description:P42336
Residue:1068
BDBM272976
NameBDBM272976
Synonyms:(S)-2-((1-(2- aminobenzo[d]thiazol- 6-yl)-7,8,9,10- tetrahydro-6-oxa-2,10a- diazacycloocta[cd]inden- 4-yl)oxy)-2- cyclopropylacetamide US10435414, Example 281
TypeSmall organic molecule
Emp. Form.C23H23N5O3S
Mol. Mass.449.525
SMILESNC(=O)[C@@H](Oc1cc2OCCCCn3c(nc(c1)c23)-c1ccc2nc(N)sc2c1)C1CC1