Reaction Details
TargetPhosphatidylinositol 4,5-bisphosphate 3-kinase catalytic subunit alpha isoform
LigandBDBM272995
Substrate/Competitorn/a
Meas. Tech.p110alpha (alpha) PI3K Binding Assay
Ki 0.045±n/a nM
Citation Braun, MGarland, KHanan, EPurkey, HStaben, STHeald, RAKnight, JMacleod, CLu, AWu, GYeap, SK Tricyclic PI3K inhibitor compounds and methods of use US Patent US10065970 Publication Date 9/4/2018
 
Phosphatidylinositol 4,5-bisphosphate 3-kinase catalytic subunit alpha isoform
Name:Phosphatidylinositol 4,5-bisphosphate 3-kinase catalytic subunit alpha isoform
Type:Enzyme Subunit
Mol. Mass.:124294.87
Organism:Homo sapiens (Human)
Description:P42336
Residue:1068
BDBM272995
NameBDBM272995
Synonyms:(2S,3R)-1-(1-(2- aminobenzo[d]thiazol- 6-yl)-7,8,9,10- tetrahydro-6-oxa-2,10a- diazacycloocta[cd]inden- 4-yl)-3- methoxypyrrolidine-2- carboxamide US10435414, Example 300
TypeSmall organic molecule
Emp. Form.C24H26N6O3S
Mol. Mass.478.567
SMILESCO[C@@H]1CCN([C@@H]1C(N)=O)c1cc2OCCCCn3c(nc(c1)c23)-c1ccc2nc(N)sc2c1