Reaction Details
TargetPhosphatidylinositol 4,5-bisphosphate 3-kinase catalytic subunit alpha isoform
LigandBDBM273003
Substrate/Competitorn/a
Meas. Tech.p110alpha (alpha) PI3K Binding Assay
Ki 0.627±n/a nM
Citation Braun, MGarland, KHanan, EPurkey, HStaben, STHeald, RAKnight, JMacleod, CLu, AWu, GYeap, SK Tricyclic PI3K inhibitor compounds and methods of use US Patent US10065970 Publication Date 9/4/2018
 
Phosphatidylinositol 4,5-bisphosphate 3-kinase catalytic subunit alpha isoform
Name:Phosphatidylinositol 4,5-bisphosphate 3-kinase catalytic subunit alpha isoform
Type:Enzyme Subunit
Mol. Mass.:124294.87
Organism:Homo sapiens (Human)
Description:P42336
Residue:1068
BDBM273003
NameBDBM273003
Synonyms:(2S,3S)-1-(1-(2- aminobenzo[d]oxazol- 5-yl)-8,9-dihydro-7H-6- oxa-2,9a- diazabenzo[cd]azulen- 4-yl)-3- methylpyrrolidine-2- carboxamide US10065970, Example 309 | US10435414, Example 309
TypeSmall organic molecule
Emp. Form.C24H26N6O3
Mol. Mass.446.5016
SMILESC[C@H]1CCN([C@@H]1C(N)=O)c1cc2OCCCCn3c(nc(c1)c23)-c1ccc2oc(N)nc2c1