Reaction Details
TargetPhosphatidylinositol 4,5-bisphosphate 3-kinase catalytic subunit alpha isoform
LigandBDBM272996
Substrate/Competitorn/a
Meas. Tech.p110alpha (alpha) PI3K Binding Assay
Ki 0.031±n/a nM
Citation Braun, MGarland, KHanan, EPurkey, HStaben, STHeald, RAKnight, JMacleod, CLu, AWu, GYeap, SK Tricyclic PI3K inhibitor compounds and methods of use US Patent US10065970 Publication Date 9/4/2018
 
Phosphatidylinositol 4,5-bisphosphate 3-kinase catalytic subunit alpha isoform
Name:Phosphatidylinositol 4,5-bisphosphate 3-kinase catalytic subunit alpha isoform
Type:Enzyme Subunit
Mol. Mass.:124294.87
Organism:Homo sapiens (Human)
Description:P42336
Residue:1068
BDBM272996
NameBDBM272996
Synonyms:(S)-2-(4-(1-(2- aminooxazolo[4,5- b]pyridin-5-yl)- 7,8,9,10-tetrahydro-6- oxa-2,10a- diazacycloocta[cd]inden- 4-yl)-1H-pyrazol-1- yl)butanamide US10065970, Example 311 | US10435414, Example 301
TypeSmall organic molecule
Emp. Form.C24H24N8O3
Mol. Mass.472.4992
SMILESCC[C@@H](C(N)=O)n1cc(cn1)-c1cc2OCCCCn3c(nc(c1)c23)-c1ccc2oc(N)nc2n1