Reaction Details
TargetDelta-type opioid receptor
LigandBDBM81935
Substrate/Competitorn/a
Ki 16.3±n/a nM
CommentsPDSP_1351
Citation Standifer, KMCheng, JBrooks, AIHonrado, CPSu, WVisconti, LMBiedler, JLPasternak, GW Biochemical and pharmacological characterization of mu, delta and kappa 3 opioid receptors expressed in BE(2)-C neuroblastoma cells. J Pharmacol Exp Ther270:1246-55 (1994) Delta-type opioid receptor
Name:Delta-type opioid receptor
Type:G Protein-Coupled Receptor (GPCR)
Mol. Mass.:40382.98
Organism:Homo sapiens (Human)
Description:Competition binding assays were carried out using membrane preparations from transfected HN9.10 cells that constitutively expressed the delta opioid receptor.
Residue:372
BDBM81935
NameBDBM81935
Synonyms:CAS_105618-26-6 Nor-BNI
TypeSmall organic molecule
Emp. Form.C40H43N3O6
Mol. Mass.661.7859
SMILESOc1ccc2CC(C3CC3)N3CCC45C(Oc1c24)c1[nH]c2C4Oc6c7c(CC(C8CC8)N8CCC47C(O)(C8)Cc2c1CC5(O)C3)ccc6O