Reaction Details
TargetKappa-type opioid receptor
LigandBDBM21025
Substrate/Competitorn/a
Ki 10.2±n/a nM
CommentsPDSP_614
Citation Standifer, KMCheng, JBrooks, AIHonrado, CPSu, WVisconti, LMBiedler, JLPasternak, GW Biochemical and pharmacological characterization of mu, delta and kappa 3 opioid receptors expressed in BE(2)-C neuroblastoma cells. J Pharmacol Exp Ther270:1246-55 (1994) Kappa-type opioid receptor
Name:Kappa-type opioid receptor
Type:G Protein-Coupled Receptor (GPCR)
Mol. Mass.:42648.76
Organism:Homo sapiens (Human)
Description:P41145
Residue:380
BDBM21025
NameBDBM21025
Synonyms:(2R)-2-[(2S)-2-{2-[(2R)-2-[(2S)-2-amino-3-(4-hydroxyphenyl)propanamido]propanamido]acetamido}-3-phenylpropanamido]-4-methylpentanoic acid BW-180C DADLE H-Tyr-D-Ala-Gly-Phe-D-Leu-OH | [D-Ala2-D-Leu5]enkephalin
TypeANALGESIC
Emp. Form.C29H39N5O7
Mol. Mass.569.6493
SMILESCC(C)C[C@@H](NC(=O)[C@H](Cc1ccccc1)NC(=O)CNC(=O)[C@@H](C)NC(=O)[C@@H](N)Cc1ccc(O)cc1)C(O)=O