Reaction Details
TargetKappa-type opioid receptor
LigandBDBM82506
Substrate/Competitorn/a
Ki 8.3±n/a nM
CommentsPDSP_1792
Citation Standifer, KMCheng, JBrooks, AIHonrado, CPSu, WVisconti, LMBiedler, JLPasternak, GW Biochemical and pharmacological characterization of mu, delta and kappa 3 opioid receptors expressed in BE(2)-C neuroblastoma cells. J Pharmacol Exp Ther270:1246-55 (1994) Kappa-type opioid receptor
Name:Kappa-type opioid receptor
Type:G Protein-Coupled Receptor (GPCR)
Mol. Mass.:42648.76
Organism:Homo sapiens (Human)
Description:P41145
Residue:380
BDBM82506
NameBDBM82506
Synonyms:CAS_29915-38-6 TAPS
TypeSmall organic molecule
Emp. Form.C7H17NO6S
Mol. Mass.243.278
SMILESOCC(CO)(CO)NCCCS(O)(=O)=O