Reaction Details
TargetMelatonin receptor type 1A
LigandBDBM9019
Substrate/Competitorn/a
Ki 0.24±n/a nM
CommentsPDSP_1189
Citation Reppert, SMWeaver, DREbisawa, T Cloning and characterization of a mammalian melatonin receptor that mediates reproductive and circadian responses. Neuron13:1177-85 (1994) 
 
Melatonin receptor type 1A
Name:Melatonin receptor type 1A
Type:Enzyme Catalytic Domain
Mol. Mass.:40421.02
Organism:Sheep
Description:Melatonin 0 Sheep::P48040
Residue:366
BDBM9019
NameBDBM9019
Synonyms:CHEMBL45 N-[2-(5-methoxy-1H-indol-3-yl)ethyl]acetamide
TypeSmall organic molecule
Emp. Form.C13H16N2O2
Mol. Mass.232.2783
SMILESCOc1ccc2[nH]cc(CCNC(C)=O)c2c1