Reaction Details
TargetHrh3 protein
LigandBDBM22888
Substrate/Competitorn/a
Ki 180±n/a nM
CommentsPDSP_445
Citation Ligneau, XGarbarg, MVizuete, MLDiaz, JPurand, KStark, HSchunack, WSchwartz, JC [125I]iodoproxyfan, a new antagonist to label and visualize cerebral histamine H3 receptors. J Pharmacol Exp Ther271:452-9 (1994) Hrh3 protein
Name:Hrh3 protein
Type:Enzyme Catalytic Domain
Mol. Mass.:37860.96
Organism:RAT
Description:Q5PPG3
Residue:344
BDBM22888
NameBDBM22888
Synonyms:1-[4-(1H-imidazol-5-yl)butyl]-3-methylthiourea CHEMBL12160
TypeSmall organic molecule
Emp. Form.C9H16N4S
Mol. Mass.212.315
SMILESCNC(=S)NCCCCc1cnc[nH]1