Reaction Details
TargetHrh3 protein
LigandBDBM82511
Substrate/Competitorn/a
Ki 20±n/a nM
CommentsPDSP_473
Citation Ligneau, XGarbarg, MVizuete, MLDiaz, JPurand, KStark, HSchunack, WSchwartz, JC [125I]iodoproxyfan, a new antagonist to label and visualize cerebral histamine H3 receptors. J Pharmacol Exp Ther271:452-9 (1994) Hrh3 protein
Name:Hrh3 protein
Type:Enzyme Catalytic Domain
Mol. Mass.:37860.96
Organism:RAT
Description:Q5PPG3
Residue:344
BDBM82511
NameBDBM82511
Synonyms:Carboperamide
TypeSmall organic molecule
Emp. Form.C15H25N3O
Mol. Mass.263.3785
SMILESCCCCCCC(=O)N1CCC(CC1)c1cnc[nH]1